.NET Tutorials, Forums, Interview Questions And Answers
Welcome :Guest
Sign In
Win Surprise Gifts!!!

Top 5 Contributors of the Month
Gaurav Pal
Post New Web Links

Workflow Infrastructure Error: 88xr Unexpected WinWF Internal Error,terminating workflow Id#03888be1

Posted By:      Posted Date: September 23, 2010    Points: 0   Category :SharePoint

Hello Friends,

I have developed a custom sequential workflow in SharePoint Server 2010 using VS 2010. My workflow gets activated and then creates a new task in the Tasks List.

But "Error Occurred" gets displayed in the Workflow column in the default view of my document library instead of "In Progress".

I debugged my code and there are no errors in it. But I found the below error in \14\LOGS\:

"SharePoint Foundation Workflow Infrastructure Error: 88xr Unexpected WinWF Internal Error,terminating workflow Id#03888be1-28c8-409d-bc65-7115bc17edfa"

I have set the properties correctly for the workflow activities in VS 2010.

Can anybody help me solve this error?

Thanks in advance...

Regards,Gautam Kaikini.

View Complete Post

More Related Resource Links

SharePoint Designer Error - Unexpected error on server associating the workflow

I am creating a multistep workflow with multiple Approval steps.  When I get to step 7 or the 7th Approval step and try to publish it, it states that "Errors were found when compiling the workflow.  The workflow files were saved but cannot be run."  With "Unexpected error on server associating the workflow" in the advanced section.  This same error occurs at other stages of the approvals as well.  If I put another process/action in the step, the workflow runs without any problem.  Thanks for the help! JeremyJeremy

Getting Unexpected Error while Publishing my Reusable Workflow


*** UPDATE ***

After waiting for anyone to respond, and needing to figure this out, went into Central Admin and reversed steps (1) & (2) below to bring my system back to the state where the workflow would compile.  That didn't work ... I am still getting the error.  So now I am lost ... what could be causing this problem?  Anyone ??


I created a reusable workflow over a week ago and it has been working perfectly. Today everytime that I try to publish the workflow I get the following error during the "Validating the workflow" step:

"Errors were found while compiling the workflow... Unexpected Error on the server associating the workflow"

The only thing that has changed between when it worked and when it doesn't is that I configured the Server to enable ability to use the "Show workflow visualization on the status page" setting.  To do this I learned that I had to provision a Secure Store Service, create a Visio App ID and associate it.  So I followed these two sets of instructions:

  1. http://tinyurl.com/39l4jl4
  2. http://tinyurl.com/24w33lg

When I first got this error I did some Googling and found some p

Workflow has failed to start due to internal error


Hello everbody,

We have critical issue w.r.t workflows in 3 site collections(Collaboration sites).
When we start a workflow for a document library/document , below error is displayed.

"The Workflow has failed due to an internal error"

We had deactivated and activated all the related workflow features at site collection level but didn't succeed. This we have also tried using SharePoint Manager 2007 .

Could you please check and help on this issue ?

Thanks in advance.


Sharepoint Designer Workflow Unexpected Error



I am using SPD to design(?) a workflow. I have two workflows of similar kind. One is working fine but the other is not. When the "Check Workflow" button is pressed, it give no error but when "Finish" is pressed it give me

Error were found when compiling the workflow. The workflow files were saved but cannot be run.

Advanced: Unexpected error on server associating the workflow

I have checked the workflow logic and I did not find logical error. I searched and found that i need to see in the web.config, but i did not find web.config file in SPD under by site.

Any ideas?

Thanks for your time,


Nintex Workflow Error: No workflows are waiting for a BizTalk message [...] No processing has been d



I created a Workflow with Nintex Workflow 2007 (on SharePoint 2007) to send/receive data to BizTalk 2009. It worked fine already. But now I get the following error mesage in the EventViewer:

Nintex Workflow; Build: 11000 (http://ls457/_layouts/nintexworkflow/BiztalkHandler.ashx)
No workflows are waiting for a BizTalk message with message Id of 'GeneralAccessRequest_2010-08-23T15_00_04_44961212B370C554EDFAC41C1201ED6CEFB' on teamsite http://ls457/sites/testapp. No processing has been done.

What could that mean? Any ideas? I definitely changed nothing on the orchestration or BizTalk administration. The BizTalk action sends the data correctly to it's destination (database), but it seems that nintex doesn't receive any return data. I don't think it's a BizTalk problem, because in the BizTalk Message Tracking Database the Message is listet, so it has been sent correctly by BizTalk. But the handler probably has problems to find/receive this message.

Kind regards,


Error loading workflow services

Hello, I'm developing a service library using the new wf 4.0 and one of my requirements is that some activities have the ability to be resumed by a client, so i created a wcf resume service that could load a workflow definition and resume a bookmark of that workflow. One of the services i created was a flowchart that has a receive reply activites inside a sequence activity has a start point, after that i have another sequence that have another sequence, yes 2 sequence activities, and my custom activity that needs to be resumed by a client. The 2 nested sequence activites was a something i used only for testing, but if i had those 2 sequence activities nested i got an error when loading that workflow definition in my resume service: 'ObtemPareceres' is not of type 'Sequence'. When loading this instance you must ensure that the activity with name 'ObtemPareceres' implements 'Sequence'. The "ObtemPareceres" is my custom activity, and if i remove that second nested sequence everything works fine. Anyone has any idea of whats going where? thanksFrederico Regateiro

Workflow "Error Occurred" Message

Hi, We have upgraded a VS 2008 custom workflow in our production environment but we are now seeing an "Error Occurred" message when starting in one site that the workflow is activated on.  It works fine on another site.  Permissions DID NOT change for users on this site before or after or during the upgrade of the workflow. It works fine in our test environment. How can I troubleshoot this in production environment (I cannot debug)? Can somebody give me a definite answer on what are the required permissions to give user to allow them to start workflows and edit only their own Tasks?  I have asked this question on a number of forums with no definitive answer.

Error Occured during workflow

Hi, i have created a workflow using VS2010 and deployed in SP2010 but while running the workflow its giving me a status message " ERROR OCCURED" my scenario is :  once we upload a document in library it should be copy to another site's or sub site's document library.  can i create a workflow using SPD2010 for this requirement? let me know if anybody have answer.   thanks share2010        

Imported Workflow project does not compile "error 348: Compilation failed. Unable to load one or mor

Original workflow project was compiled on 32 bit machine. I exported it to VS.Net 2010 and it fails to compile. Has anybody seen this error? -Stan  

VS 2010 and error while compiling Workflow project

Get the following message:   ------ Build started: Project: DSS_IP_WorkFlow, Configuration: Debug Any CPU ------ C:\PRJ\JD Powers\DssIP\DSS_IPSoln\DSS_IP.2010\DSSIP\DSSIP-Simulator\DSS_IP_WorkFlow : error 348: Compilation failed. Unable to load one or more of the requested types. Retrieve the LoaderExceptions property for more information.   What I'm doing wrong to my project?

state machine workflow project creation error

Hi,   I have a dev environment which i had sharepoint 2007 and now i upgraded it to sharepoint 2010. Now when i try to create a state machine workflow project it gives me an error Object Reference not set to an object. I uninstalled Sharepoint extensions 1.3 (as i 64bit win2008 vm) and when i am trying to install it. In one of the installation screens where it asks for the port no  and the select the app pool it only shows the sharepoint central v3 app pool . i was expecting to have sharepoint 2010 product app pool in the drop down. I know that there should be a app pool on port 80. Since i upgraded sharepoint to 2010. I want sharepoint visual studio extensions 1.3 to point to sharepoint 80 app pool . Please can you tell me how i can do it.    

Error customizing Approval Workflow in SharePoint Designer

When attempting to customize OOTB Approval Workflow, message "Workflow is read only?"  Request copy errors with "Server could not complete your request" Details button produces blank.  Any clue?  I am the site collection administrator for the site and the secondary farm administrator.

Error editing a document that is running a workflow

After workflow is started i try edit document, but this error is displayed: System.ArgumentNullException: Value cannot be null.  Parameter name: s     em System.IO.StringReader..ctor(String s)      em System.Xml.XmlDocument.LoadXml(String xml)      em Microsoft.SharePoint.Publishing.Internal.WorkflowUtilities.FlattenXmlToHashtable(String strXml)      em Microsoft.SharePoint.Publishing.Internal.WorkflowUtilities.DoesWorkflowCancelWhenItemEdited(String associationXml)      em Microsoft.SharePoint.Publishing.WebControls.ConsoleDataSource.EnsurePageNotInLockingWorkflowIfInEditMode()      em Microsoft.SharePoint.Publishing.WebControls.ConsoleDataSource.LoadDataSource()      em Microsoft.SharePoint.Publishing.WebControls.ConsoleDataSource.OnLoad(EventArgs e)      em Microsoft.SharePoint.Publishing.WebControls.XmlConsoleDataSource.OnLoad(EventArgs e)      em Microsoft.Share.Point.Publishing.WebControls.PublishingSiteActionsMenuCustomizer.OnLoad(EventArgs e)      em System.Web.UI.Control.LoadRecursive()      em System.Web.UI.Control.LoadRecursive()      em System.Web.UI.Control.L

Access Denied/The workflow could not copy the item workflow error after Sharepoint 2010 upgrade

We have a sharepoint designer workflow that copies a document from one library to another on the same site.  Before the upgrade to 2007 it worked fine, but now with 2010 it gives an error and cancels the workflow when it gets to the copy list item step.   The error on the workflow page: The workflow could not copy the item. Make sure the source and destination lists have the same columns and column settings.  Access Denied   Specifically it is the "copy list item current item to documentlibrary" sharepoint designer workflow action.   I have given the system account full permissions to the library and double checked that all columns are the same in both libraries. These are the verbose trace logs:   09/01/2010 09:46:04.05 w3wp.exe (0x17C4) 0x093C SharePoint Foundation Workflow Infrastructure 72er Medium System.UnauthorizedAccessException: <nativehr>0x80070005</nativehr><nativestack></nativestack>Access denied. at Microsoft.SharePoint.SPFile.UpdateInternal(Boolean migrationSemantics, Boolean reGhost) at Microsoft.SharePoint.Workflow.SPWinOEWSSService.CommitCopyFile(Transaction txn, Object[] transData) 09/01/2010 09:46:04.05 w3wp.exe (0x17C4) 0x093C SharePoint Foundation Workflow Infrastructure 72fe High Error in commiting pending workflow batch items: Sys

Receiving Error when Trying to Develop Sharepoint 2007 Workflow using VS 2010 Pro

I have created a Windows Server 2003 Enterprise (32 bit) SP2 image configured with Sharepoint 2007 Enterprise and a trial edition of Visual Studio 2010 Professional.  All software is fully patched.  When I try to create a new Sharepoint 2007 Sequential Workflow (.NET Framework 3.5) in either C# or VB, I receive a pop-up error: Exception of type 'System.PlatformNotSupportedException' was thrown. and, when I click OK and fill in the name of the workflow and a valid Sharepoint Web URL for testing, I receive the following error: SharePoint site location entered is not valid.  The SharePoint site at <removed> could not be found.  Verify that you have typed the URL correctly.  If the URL should be serving existing content, the system administrator may need to add a new request URL mapping to the intended application. The URL in question references the default SharePoint site on this test server and does exist.  My assumption is that the second error received is a symptom of the first.  I have looked elsewhere and seen issues related to 64bit SharePoint implementations but, this is a 32 bit installation.  Based on the VS 2010 web site, I have met all of the prerequisites for developing SharePoint 2007 workflows through VS 2010 Pro.  Does anyone have any ideas on what I might be missing or what I need to

An error has occured in Workflow name ?

My library setting- Workflow settings - "Cancellation & Error Report" : Description shows An error has occured in Workflow name. My question is : 1. What is the meaning of the above error? 2. how can i see the detail description of this error? 3. Why this message is coming? Thank in advance for your reply, Justin  

Workflow project compilation fails with error 348: Compilation failed. Cannot execute a program.

Hi, I am trying to build a workflow project on a PC and I am getting the "error 348: Compilation failed. Cannot execute a program." error. This project is part of a bigger solution and it used to build just fine on my PC. Also, the project and the solution build OK on several other computers. I am sure that the problem is something on my PC. 1. I am not sure what changed to make the project start failing. 2. I tried to delete the project, source and all folders from the disk and sync to the source control again 3. Re-installed the .NET 3.5 framework 4. Uninstalled Visual Studio 2008, deleted the visual studio folder under program files, and reinstalled VS 2008 5. I noticed the the file referenced in the error "...Temp\8sl_helt.cmdline" does not exist under the Temp folder. An empty folder called "8sl_helt"however is created, but there is no file with the cmdline extension. I turned up the output log to "diagnostics", this is the output generated when the error happens. Have anybody seen this? Done building target "_ComputeNonExistentFileProperty" in project "QCReviewWorkflowLibrary.csproj". Target "CreateWorkflowManifestResourceNames" skipped. Previously built successfully. Target "WorkflowCompilation" in file "C:\Program Files\MSBuild\Microsoft\Windows Workflow Foundation\v3.5\Workflow.T
ASP.NetWindows Application  .NET Framework  C#  VB.Net  ADO.Net  
Sql Server  SharePoint  Silverlight  Others  All   

Hall of Fame    Twitter   Terms of Service    Privacy Policy    Contact Us    Archives   Tell A Friend